BDBM143249 US10017516, Compound 9::US9682983, 9
SMILES Oc1cc(-c2cnn3cc(cnc23)-c2ccc(cc2)N2CCNCC2)c2ccccc2n1
InChI Key InChIKey=RMMCJMFEDYDIHX-UHFFFAOYSA-N
Data  6 IC50
  Tab Delimited (TSV)   2D SDfile   Computed 3D by Vconf -m prep SDfile
Find this compound or compounds like it in BindingDB:
Activity Spreadsheet -- Enzyme Inhibition Constant Data from BindingDB
Found 6 hits for monomerid = 143249
TargetSerine/threonine-protein kinase receptor R3(Homo sapiens (Human))
The Brigham And Women'S Hospital
US Patent
LigandPNGBDBM143249(US10017516, Compound 9 | US9682983, 9)
Affinity DataIC50:  4.69E+3nMpH: 7.5Assay Description:Specifically, compounds were assayed using LANCE® Ultra ULight¿ technology (Perkin Elmer) against human ALK1-6 enzymes (ALK1: Life Technologies, ALK2...
Ligand InfoPC cidPC sid
In DepthDetails US Patent
TargetActivin receptor type-1(Homo sapiens (Human))
The Brigham And Women'S Hospital
US Patent
LigandPNGBDBM143249(US10017516, Compound 9 | US9682983, 9)
Affinity DataIC50:  792nMpH: 7.5Assay Description:Specifically, compounds were assayed using LANCE® Ultra ULight¿ technology (Perkin Elmer) against human ALK1-6 enzymes (ALK1: Life Technologies, ALK2...
Ligand InfoPC cidPC sid
In DepthDetails US Patent
TargetBone morphogenetic protein receptor type-1B(Homo sapiens (Human))
The Brigham And Women'S Hospital
US Patent
LigandPNGBDBM143249(US10017516, Compound 9 | US9682983, 9)
Affinity DataIC50:  5.56E+4nM. Assay description: Compounds were assessed in ALK1-6 enzymatic assays. Specifically, compounds were assayed using LANCE® Ultra ULight technology (Perkin Elmer) against ...
Ligand InfoPC cidPC sid
In DepthDetails US Patent
TargetSerine/threonine-protein kinase receptor R3(Homo sapiens (Human))
The Brigham And Women'S Hospital
US Patent
LigandPNGBDBM143249(US10017516, Compound 9 | US9682983, 9)
Affinity DataIC50:  4.69E+3nM. Assay description: Compounds were assessed in ALK1-6 enzymatic assays. Specifically, compounds were assayed using LANCE® Ultra ULight technology (Perkin Elmer) against ...
Ligand InfoPC cidPC sid
In DepthDetails US Patent
TargetActivin receptor type-1(Homo sapiens (Human))
The Brigham And Women'S Hospital
US Patent
LigandPNGBDBM143249(US10017516, Compound 9 | US9682983, 9)
Affinity DataIC50:  792nM. Assay description: Compounds were assessed in ALK1-6 enzymatic assays. Specifically, compounds were assayed using LANCE® Ultra ULight technology (Perkin Elmer) against ...
Ligand InfoPC cidPC sid
In DepthDetails US Patent
TargetBone morphogenetic protein receptor type-1B(Homo sapiens (Human))
The Brigham And Women'S Hospital
US Patent
LigandPNGBDBM143249(US10017516, Compound 9 | US9682983, 9)
Affinity DataIC50:  5.56E+4nMpH: 7.5Assay Description:Specifically, compounds were assayed using LANCE® Ultra ULight¿ technology (Perkin Elmer) against human ALK1-6 enzymes (ALK1: Life Technologies, ALK2...
Ligand InfoPC cidPC sid
In DepthDetails US Patent