BDBM143612 US9682955, 9
SMILES FC(F)(F)S(=O)(=O)NC1CCN(C1)c1ncnc2ccc(cc12)C(c1ccc(Cl)cc1)c1ccc(Cl)cc1
InChI Key InChIKey=FSXOKHIQAUZKIL-UHFFFAOYSA-N
Data  2 EC50
  Tab Delimited (TSV)   2D SDfile   Computed 3D by Vconf -m prep SDfile
Find this compound or compounds like it in BindingDB:
Activity Spreadsheet -- Enzyme Inhibition Constant Data from BindingDB
Found 2 hits for monomerid = 143612
TargetCannabinoid receptor 2(Homo sapiens (Human))
Janssen Pharmaceutica
US Patent
LigandPNGBDBM143612(US9682955, 9)
Affinity DataEC50:  150nMT: 2°C. Assay description: The following mixtures and buffer solutions were prepared: (a) Buffer 1: HBSS (Mediatech Cat#21-023-CV) with 5 mM HEPES (1 mM stock, Gibco BRL Cat#15...
Ligand InfoPC cidPC sid
In DepthDetails US Patent
TargetCannabinoid receptor 1(Homo sapiens (Human))
Janssen Pharmaceutica
US Patent
LigandPNGBDBM143612(US9682955, 9)
Affinity DataEC50:  191nMT: 2°C. Assay description: The following mixtures and buffer solutions were prepared: (a) Buffer 1: HBSS (Mediatech Cat#21-023-CV) with 5 mM HEPES (1 mM stock, Gibco BRL Cat#15...
Ligand InfoPC cidPC sid
In DepthDetails US Patent