BDBM14400 5-(5-acetyl-2-propoxypyridin-3-yl)-3-ethyl-2-(1-methylazetidin-3-yl)-2H,6H,7H-pyrazolo[4,3-d]pyrimidin-7-one::Sildenafil 5-methyl ketone analogue 27
SMILES CCCOc1ncc(cc1-c1nc2c(CC)n(nc2c(=O)[nH]1)C1CN(C)C1)C(C)=O
InChI Key InChIKey=CXFRDANOUSHETD-UHFFFAOYSA-N
Data  1 IC50
  Tab Delimited (TSV)   2D SDfile   Computed 3D by Vconf -m prep SDfile
Find this compound or compounds like it in BindingDB:
Activity Spreadsheet -- Enzyme Inhibition Constant Data from BindingDB
Found 1 hit for monomerid = 14400
TargetcGMP-specific 3',5'-cyclic phosphodiesterase(Homo sapiens (Human))
Pfizer
LigandPNGBDBM14400(5-(5-acetyl-2-propoxypyridin-3-yl)-3-ethyl-2-(1-me...)
Affinity DataIC50:  9.5nMpH: 7.4 T: 2°C. Assay description: PDE5 or PDE6 catalytic activity was monitored by measuring the hydrolysis of [3H]-cGMP to [3H]-GMP using a scintillation proximity assay (SPA). [3H]-...
In DepthDetails ArticlePubMed