BDBM148181 US8962616, 9
SMILES Cc1nccc(n1)[C@H]1CC2CSC(N)=N[C@]2(CO1)c1ccc(F)cc1F
InChI Key InChIKey=NCFZOHVZLVQZGK-APTIMPFDSA-N
Data  2 IC50
  Tab Delimited (TSV)   2D SDfile   Computed 3D by Vconf -m prep SDfile
Find this compound or compounds like it in BindingDB:
Activity Spreadsheet -- Enzyme Inhibition Constant Data from BindingDB
Found 2 hits for monomerid = 148181
TargetBeta-secretase 2(Homo sapiens (Human))
Pfizer
US Patent
LigandPNGBDBM148181(US8962616, 9)
Affinity DataIC50: >1.00E+5nMpH: 4.5 T: 2°C. Assay description: This assay measures the inhibition of the BACE2 enzyme as it cleaves a non-native peptide. A synthetic substrate that can be cleaved by BACE2 having ...
In DepthDetails US Patent
TargetBeta-secretase 1(Homo sapiens (Human))
Pfizer
US Patent
LigandPNGBDBM148181(US8962616, 9)
Affinity DataIC50:  583nM. Assay description: Beta-secretase (BACE) is one of the enzymes involved in the generation of the amyloid beta peptide found in the amyloid plaques of Alzheimer's Diseas...
In DepthDetails US Patent