BDBM150284 US8987239, 9
SMILES C[C@]12CCC3C4CCC(=O)C=C4C4CC4C3C1C1CC1[C@@]21CCC(=O)O1
InChI Key InChIKey=WAORTEATHIIKSN-COBLQOHFSA-N
Data  2 IC50
  Tab Delimited (TSV)   2D SDfile   Computed 3D by Vconf -m prep SDfile
Find this compound or compounds like it in BindingDB:
Activity Spreadsheet -- Enzyme Inhibition Constant Data from BindingDB
Found 2 hits for monomerid = 150284
TargetAndrogen receptor(Homo sapiens (Human))
Bayer Intellectual Property Gbmh
US Patent
LigandPNGBDBM150284(US8987239, 9)
Affinity DataIC50:  330nM. Assay description: The test was carried out as in 1, with the following modifications: cytosol from androgen receptor-expressing insect cells (Hi5) was used, and the re...
In DepthDetails US Patent
TargetProgesterone receptor(Homo sapiens (Human))
Bayer Intellectual Property Gbmh
US Patent
LigandPNGBDBM150284(US8987239, 9)
Affinity DataIC50:  24nM. Assay description: Using cytosol from progesterone receptor-expressing insect cells (Hi5), competitive binding to the progesterone receptor was determined from the abil...
In DepthDetails US Patent