BDBM150724 4‐bromo‐2‐[(3,4‐dichlorophenyl)carbamoyl]phenyl diethyl phosphate (4)
SMILES CCOP(=O)(OCC)Oc1ccc(Br)cc1C(=O)Nc1ccc(Cl)c(Cl)c1
InChI Key InChIKey=VTOUJCOSUXDNJF-UHFFFAOYSA-N
Data  2 IC50
  Tab Delimited (TSV)   2D SDfile   Computed 3D by Vconf -m prep SDfile
Find this compound or compounds like it in BindingDB:
Activity Spreadsheet -- Enzyme Inhibition Constant Data from BindingDB
Found 2 hits for monomerid = 150724
TargetCarboxylic ester hydrolase(Equus caballus (Horse))
Charles University In Prague
LigandPNGBDBM150724(4‐bromo‐2‐[(3,4‐dichloroph...)
Affinity DataIC50:  4.96E+4nM. Assay description: The reaction mixture containing phosphate buffer, AChE or BChE and chosen compounds was prepared and intensively stirred. In given times (5, 10, 15, ...
In DepthDetails ArticlePubMed
TargetAcetylcholinesterase(Electrophorus electricus (Electric eel))
Charles University In Prague
LigandPNGBDBM150724(4‐bromo‐2‐[(3,4‐dichloroph...)
Affinity DataIC50:  5.52E+4nM. Assay description: The reaction mixture containing phosphate buffer, AChE or BChE and chosen compounds was prepared and intensively stirred. In given times (5, 10, 15, ...
In DepthDetails ArticlePubMed