BDBM150819 US8981106, 9
SMILES OB(O)c1ccccc1CCSc1ccc(cn1)C(=O)Nc1ccc(F)cc1
InChI Key InChIKey=TVANIYMHXPLFFL-UHFFFAOYSA-N
Data  1 IC50
  Tab Delimited (TSV)   2D SDfile   Computed 3D by Vconf -m prep SDfile
Find this compound or compounds like it in BindingDB:
Activity Spreadsheet -- Enzyme Inhibition Constant Data from BindingDB
Found 1 hit for monomerid = 150819
TargetC-X-C chemokine receptor type 2(Homo sapiens (Human))
Syntrix Biosystems
US Patent
LigandPNGBDBM150819(US8981106, 9)
Affinity DataIC50:  387nMT: 2°C. Assay description: An in vitro assay showed inhibition of CXCR2-mediated intracellular calcium release. Briefly, human neutrophils were suspended in HBSS- (without Ca2+...
In DepthDetails US Patent