BDBM15594 N-Methyl,N-(benzy),N-(1-methylpyrrol-2-ylmethyl)amine::benzyl(methyl)[(1-methyl-1H-pyrrol-2-yl)methyl]amine::pyrrole inhibitor 19
SMILES CN(Cc1cccn1C)Cc1ccccc1
InChI Key InChIKey=MQECFYXUIGHGIA-UHFFFAOYSA-N
Data  3 KI
  Tab Delimited (TSV)   2D SDfile   Computed 3D by Vconf -m prep SDfile
Find this compound or compounds like it in BindingDB:
Activity Spreadsheet -- Enzyme Inhibition Constant Data from BindingDB
Found 3 hits for monomerid = 15594
TargetAmine oxidase [flavin-containing] A(Bos taurus)
Sapienza University Of Rome
LigandPNGBDBM15594(N-Methyl,N-(benzy),N-(1-methylpyrrol-2-ylmethyl)am...)
Affinity DataKi:  150nM ΔG°:  -9.71kcal/molepH: 7.4 T: 2°C. Assay description: MAO A and MAO B activities were determined spectrophotometrically using kinuramine as substrates. Fluorimetric measurements were recorded with a Perk...
In DepthDetails ArticlePubMed
TargetAmine oxidase [flavin-containing] B(Bos taurus)
Sapienza University Of Rome
LigandPNGBDBM15594(N-Methyl,N-(benzy),N-(1-methylpyrrol-2-ylmethyl)am...)
Affinity DataKi:  8.50E+4nM. Assay description: MAO A and MAO B activities were determined spectrophotometrically using kinuramine as substrates. Fluorimetric measurements were recorded with a Perk...
In DepthDetails ArticlePubMed
TargetAmine oxidase [flavin-containing] A(Homo sapiens (Human))
Bharati Vidyapeeth Deemed University
Curated by ChEMBL
LigandPNGBDBM15594(N-Methyl,N-(benzy),N-(1-methylpyrrol-2-ylmethyl)am...)
Affinity DataKi:  1.50E+8nM. Assay description: Inhibition of MAO-A receptor
In DepthDetails ArticlePubMed