BDBM156303 US9018217, 2-(1-Methyl-4-phenyl-1H-imidazol-2-ylsulfanylmethyl)-1-phenyl-1H-benzoimidazole::US9592230, 2-(1-Methyl-4-phenyl-1H-imidazol-2-ylsulfanylmethyl)-1-phenyl-1H-benzoimidazole
SMILES Cn1cc(nc1SCc1nc2ccccc2n1-c1ccccc1)-c1ccccc1
InChI Key InChIKey=MEZLKLXXODLHSA-UHFFFAOYSA-N
Data  2 IC50
  Tab Delimited (TSV)   2D SDfile   Computed 3D by Vconf -m prep SDfile
Find this compound or compounds like it in BindingDB:
Activity Spreadsheet -- Enzyme Inhibition Constant Data from BindingDB
Found 2 hits for monomerid = 156303
TargetcAMP and cAMP-inhibited cGMP 3',5'-cyclic phosphodiesterase 10A(Homo sapiens (Human))
H. Lundbeck
US Patent
LigandPNGBDBM156303(US9018217, 2-(1-Methyl-4-phenyl-1H-imidazol-2-ylsu...)
Affinity DataIC50:  580nM. Assay description: A PDE10A assay may for example, be performed as follows: The assay is performed in 60 uL samples containing a fixed amount of the relevant PDE enzyme...
Ligand InfoPC cidPC sid
In DepthDetails US Patent
TargetcAMP and cAMP-inhibited cGMP 3',5'-cyclic phosphodiesterase 10A(Homo sapiens (Human))
H. Lundbeck
US Patent
LigandPNGBDBM156303(US9018217, 2-(1-Methyl-4-phenyl-1H-imidazol-2-ylsu...)
Affinity DataIC50:  580nMT: 2°C. Assay description: A PDE10A assay may for example, be performed as follows: The assay is performed in 60 uL samples containing a fixed amount of the relevant PDE enzyme...
Ligand InfoPC cidPC sid
In DepthDetails US Patent