BDBM15715 4-Benzoyl-2-phenyl-2H-pyrazole-3-carbonitrile::4-benzoyl-1-phenyl-1H-pyrazole-5-carbonitrile::pyrazole 2
SMILES O=C(c1cnn(c1C#N)-c1ccccc1)c1ccccc1
InChI Key InChIKey=WGZYVHFXLPDNDL-UHFFFAOYSA-N
Data  1 IC50
  Tab Delimited (TSV)   2D SDfile   Computed 3D by Vconf -m prep SDfile
Find this compound or compounds like it in BindingDB:
Activity Spreadsheet -- Enzyme Inhibition Constant Data from BindingDB
Found 1 hit for monomerid = 15715
TargetMitogen-activated protein kinase 14(Homo sapiens (Human))
Roche Palo Alto
LigandPNGBDBM15715(4-Benzoyl-2-phenyl-2H-pyrazole-3-carbonitrile | 4-...)
Affinity DataIC50: >1.00E+5nMpH: 7.4 T: 2°C. Assay description: Inhibition of human recombinant active p38alpha MAP kinase was tested by measuring the incorporation of 33P from gamma-[33P] ATP into myelin basic pr...
Ligand InfoPC cidPC sid
In DepthDetails ArticlePubMed