BDBM15720 4-benzoyl-1-(4-fluorophenyl)-1H-pyrazol-5-amine::aminopyrazole 11
SMILES Nc1c(cnn1-c1ccc(F)cc1)C(=O)c1ccccc1
InChI Key InChIKey=DVLXTGOCPDWTOP-UHFFFAOYSA-N
Data  1 IC50
  Tab Delimited (TSV)   2D SDfile   Computed 3D by Vconf -m prep SDfile
Find this compound or compounds like it in BindingDB:
Activity Spreadsheet -- Enzyme Inhibition Constant Data from BindingDB
Found 1 hit for monomerid = 15720
TargetMitogen-activated protein kinase 14(Homo sapiens (Human))
Roche Palo Alto
LigandPNGBDBM15720(4-benzoyl-1-(4-fluorophenyl)-1H-pyrazol-5-amine | ...)
Affinity DataIC50:  1.10E+3nMpH: 7.4 T: 2°C. Assay description: Inhibition of human recombinant active p38alpha MAP kinase was tested by measuring the incorporation of 33P from gamma-[33P] ATP into myelin basic pr...
In DepthDetails ArticlePubMed