BDBM15721 4-benzoyl-1-(3-fluorophenyl)-1H-pyrazol-5-amine::aminopyrazole 12
SMILES Nc1c(cnn1-c1cccc(F)c1)C(=O)c1ccccc1
InChI Key InChIKey=GGGHLTUJORAMEK-UHFFFAOYSA-N
Data  1 IC50
  Tab Delimited (TSV)   2D SDfile   Computed 3D by Vconf -m prep SDfile
Find this compound or compounds like it in BindingDB:
Activity Spreadsheet -- Enzyme Inhibition Constant Data from BindingDB
Found 1 hit for monomerid = 15721
TargetMitogen-activated protein kinase 14(Homo sapiens (Human))
Roche Palo Alto
LigandPNGBDBM15721(4-benzoyl-1-(3-fluorophenyl)-1H-pyrazol-5-amine | ...)
Affinity DataIC50:  6.70E+3nMpH: 7.4 T: 2°C. Assay description: Inhibition of human recombinant active p38alpha MAP kinase was tested by measuring the incorporation of 33P from gamma-[33P] ATP into myelin basic pr...
In DepthDetails ArticlePubMed