BDBM159795 US9040518, 9
SMILES CCCC[C@]1(CC)CS(=O)(=O)c2cc(C=C)c(OC)cc2[C@H](N1)c1ccccc1
InChI Key InChIKey=UULJKKGMHQPNOS-DNQXCXABSA-N
Data  1 IC50
  Tab Delimited (TSV)   2D SDfile   Computed 3D by Vconf -m prep SDfile
Find this compound or compounds like it in BindingDB:
Activity Spreadsheet -- Enzyme Inhibition Constant Data from BindingDB
Found 1 hit for monomerid = 159795
TargetIleal sodium/bile acid cotransporter(Homo sapiens (Human))
Glaxosmithkline
US Patent
LigandPNGBDBM159795(US9040518, 9)
Affinity DataIC50:  3nMT: 2°C. Assay description: On the day of the uptake experiment, 10 mM HEPES was added to Hank's Balanced Salt Solution, and the pH was adjusted to 7.4 with TRIS (HBSSH). The as...
In DepthDetails US Patent