BDBM160838 US9682976, 9
SMILES CC(C)N1CCC(CC1)Oc1ccc(Nc2ncc(F)c(N[C@H]3C[C@@H]4CCCN4C(C)(C)C3)n2)cc1OC(F)F
InChI Key InChIKey=HOCYSKMLCFDQRG-SFTDATJTSA-N
Data  1 EC50
  Tab Delimited (TSV)   2D SDfile   Computed 3D by Vconf -m prep SDfile
Find this compound or compounds like it in BindingDB:
Activity Spreadsheet -- Enzyme Inhibition Constant Data from BindingDB
Found 1 hit for monomerid = 160838
TargetInterleukin-2(Homo sapiens (Human))
Rigel Pharmaceuticals
US Patent
LigandPNGBDBM160838(US9682976, 9)
Affinity DataEC50: <500nM. Assay description: Primary T cell stimulation and IL2 ELISA: Human primary T cells (100,000 cells per well) were pre-incubated with or without test compound in Yssel...
Ligand InfoPC cidPC sid
In DepthDetails US Patent