BDBM161103 US9051265, 9
SMILES Fc1ccc(Cn2ccc3cc(ccc23)C(=O)NCc2ccccc2)c(F)c1
InChI Key InChIKey=SEBDQZFHHSFVFV-UHFFFAOYSA-N
Data  1 IC50
  Tab Delimited (TSV)   2D SDfile   Computed 3D by Vconf -m prep SDfile
Find this compound or compounds like it in BindingDB:
Activity Spreadsheet -- Enzyme Inhibition Constant Data from BindingDB
Found 1 hit for monomerid = 161103
TargetPeroxisome proliferator-activated receptor gamma(Homo sapiens (Human))
The Scripps Research Institute
US Patent
LigandPNGBDBM161103(US9051265, 9)
Affinity DataIC50:  5nM. Assay description: The assay was performed according to manufacturer protocol. A mixture of 5 nM GST-PPARG-LBD, 5 nM Tb-GST-antibody, 5 nM Fluormone Pan- PPAR Green, an...
In DepthDetails US Patent