BDBM162253 US9051311, 9
SMILES Clc1ccc(cc1)-c1cccc2CN(CCc12)S(=O)(=O)Nc1ncns1
InChI Key InChIKey=ZLNYEWDUKJWZID-UHFFFAOYSA-N
Data  3 IC50
  Tab Delimited (TSV)   2D SDfile   Computed 3D by Vconf -m prep SDfile
Find this compound or compounds like it in BindingDB:
Activity Spreadsheet -- Enzyme Inhibition Constant Data from BindingDB
Found 3 hits for monomerid = 162253
TargetSodium channel protein type 9 subunit alpha(Homo sapiens (Human))
Amgen
US Patent
LigandPNGBDBM162253(US9051311, 9)
Affinity DataIC50:  477nM. Assay description: In Vitro Assays 293 cells stably transfected with either Nav 1.7 or with Nav 1.5 were recorded in population patch-clamp mode with the Ion Works® Qua...
In DepthDetails US Patent
TargetSodium channel protein type 9 subunit alpha(Homo sapiens (Human))
Amgen
US Patent
LigandPNGBDBM162253(US9051311, 9)
Affinity DataIC50:  610nM. Assay description: 293 cells stably transfected with human Navl .7 were recorded in whole cell voltage clamp mode with the PatchXpress automated electrophysiology syste...
In DepthDetails US Patent
TargetSodium channel protein type 5 subunit alpha(Homo sapiens (Human))
Amgen
US Patent
LigandPNGBDBM162253(US9051311, 9)
Affinity DataIC50: >1.00E+4nM. Assay description: In Vitro Assays 293 cells stably transfected with either Nav 1.7 or with Nav 1.5 were recorded in population patch-clamp mode with the Ion Works® Qua...
In DepthDetails US Patent