BDBM163365 US9687479, 260 ethyl 2-[3-(5-[(5-chlorothiophen-2-yl)methyl]amino-1H-pyrazol-3-yl)-2-oxo-1,2-dihydropyridin-1-yl]acetate
SMILES CCOC(=O)Cn1cccc(-c2cc(NCc3ccc(Cl)s3)nn2)c1=O
InChI Key InChIKey=LJVSMNPKSIHWBH-UHFFFAOYSA-N
Data  1 IC50
  Tab Delimited (TSV)   2D SDfile   Computed 3D by Vconf -m prep SDfile
Find this compound or compounds like it in BindingDB:
Activity Spreadsheet -- Enzyme Inhibition Constant Data from BindingDB
Found 1 hit for monomerid = 163365
TargetProthrombin(Homo sapiens (Human))
Verseon
US Patent
LigandPNGBDBM163365(US9687479, 260 ethyl 2-[3-(5-[(5-chlorothiophen-2-...)
Affinity DataIC50:  5.50E+4nMpH: 7.4 T: 2°C. Assay description: Human thrombin was obtained from Haematologic Technologies Inc. The chromogenic substrate S-2238 was obtained from DiaPharma. Thrombin was assayed in...
Ligand InfoPC cidPC sid
In DepthDetails US Patent