BDBM16731 Naphthyl Compound, 5b::ethyl 2-{4-[2-(naphthalene-1-amido)-4-phenylphenyl]piperazin-1-yl}acetate
SMILES CCOC(=O)CN1CCN(CC1)c1ccc(cc1NC(=O)c1cccc2ccccc12)-c1ccccc1
InChI Key InChIKey=VELNTZUBONHZJA-UHFFFAOYSA-N
Data  2 IC50
  Tab Delimited (TSV)   2D SDfile   Computed 3D by Vconf -m prep SDfile
Find this compound or compounds like it in BindingDB:
Activity Spreadsheet -- Enzyme Inhibition Constant Data from BindingDB
Found 2 hits for monomerid = 16731
TargetBeta-secretase 1(Homo sapiens (Human))
Applied Science University
Curated by ChEMBL
LigandPNGBDBM16731(Naphthyl Compound, 5b | ethyl 2-{4-[2-(naphthalene...)
Affinity DataIC50:  90nM. Assay description: Inhibition of BACE1 after 2 hrs by FRET assay
In DepthDetails ArticlePubMed
TargetBeta-secretase 1(Homo sapiens (Human))
Applied Science University
Curated by ChEMBL
LigandPNGBDBM16731(Naphthyl Compound, 5b | ethyl 2-{4-[2-(naphthalene...)
Affinity DataIC50:  90nMpH: 7.5 T: 2°C. Assay description: These experiments have been preformed using BACE-1 FRET assay kit (PanVera Corporation, Madison, WI), using a multiwell spectrofluorometer instrument...
In DepthDetails ArticlePubMed