BDBM167923 (1-(3-Fluorobenzyl)-1H-1,2,3-triazol-4-yl)methyl 2-(2-oxo-2H-chromen-4-yloxy)acetate (8i)
SMILES Fc1cccc(Cn2cc(COC(=O)COc3cc(=O)oc4ccccc34)nn2)c1
InChI Key InChIKey=SMQKCEPNZUUANS-UHFFFAOYSA-N
Data  2 IC50
  Tab Delimited (TSV)   2D SDfile   Computed 3D by Vconf -m prep SDfile
Find this compound or compounds like it in BindingDB:
Activity Spreadsheet -- Enzyme Inhibition Constant Data from BindingDB
Found 2 hits for monomerid = 167923
TargetCarboxylic ester hydrolase(Equus caballus (Horse))
Tehran University Of Medical Sciences
LigandPNGBDBM167923((1-(3-Fluorobenzyl)-1H-1,2,3-triazol-4-yl)methyl 2...)
Affinity DataIC50: >5.00E+4nMpH: 8.0Assay Description:The target compounds were dissolved in a mixture of 1 mL DMSO and 9 mL methanol and diluted in 0.1 M KH2PO4/K2HPO4 buffer (pH 8.0) to obtain final co...
In DepthDetails ArticlePubMed
TargetAcetylcholinesterase(Electrophorus electricus (Electric eel))
Tehran University Of Medical Sciences
LigandPNGBDBM167923((1-(3-Fluorobenzyl)-1H-1,2,3-triazol-4-yl)methyl 2...)
Affinity DataIC50:  1.64E+3nMpH: 8.0Assay Description:The target compounds were dissolved in a mixture of 1 mL DMSO and 9 mL methanol and diluted in 0.1 M KH2PO4/K2HPO4 buffer (pH 8.0) to obtain final co...
In DepthDetails ArticlePubMed