BDBM170178 US9079902, 9
SMILES Cn1cc(-c2cccnc2)c2ccc(cc12)S(=O)(=O)Nc1ncns1
InChI Key InChIKey=SHPXAWZPNJIJGI-UHFFFAOYSA-N
Data  2 IC50
  Tab Delimited (TSV)   2D SDfile   Computed 3D by Vconf -m prep SDfile
Find this compound or compounds like it in BindingDB:
Activity Spreadsheet -- Enzyme Inhibition Constant Data from BindingDB
Found 2 hits for monomerid = 170178
TargetSodium channel protein type 5 subunit alpha(Homo sapiens (Human))
Amgen
US Patent
LigandPNGBDBM170178(US9079902, 9)
Affinity DataIC50: >1.00E+4nM. Assay description: 293 cells stably transfected with either Nav 1.7 or with Nav 1.5 were recorded in population patch-clamp mode with the IonWorks® Quattro automated el...
In DepthDetails US Patent
TargetSodium channel protein type 9 subunit alpha(Homo sapiens (Human))
Amgen
US Patent
LigandPNGBDBM170178(US9079902, 9)
Affinity DataIC50:  1.70E+3nM. Assay description: 293 cells stably transfected with either Nav 1.7 or with Nav 1.5 were recorded in population patch-clamp mode with the IonWorks® Quattro automated el...
In DepthDetails US Patent