BDBM173640 US9102591, 2-Methyl-N-(1-methyl-4-phenyl-piperidin-4-ylmethyl)-benzamide::US9649308, 2-Methyl-N-(1-methyl-4-phenyl-piperidin-4-ylmethyl)-benzamide
SMILES CN1CCC(CNC(=O)c2ccccc2C)(CC1)c1ccccc1
InChI Key InChIKey=OZRXZNCUIZXGPD-UHFFFAOYSA-N
Data  2 IC50
  Tab Delimited (TSV)   2D SDfile   Computed 3D by Vconf -m prep SDfile
Find this compound or compounds like it in BindingDB:
Activity Spreadsheet -- Enzyme Inhibition Constant Data from BindingDB
Found 2 hits for monomerid = 173640
TargetP2X purinoceptor 7(Homo sapiens (Human))
H. Lundbeck
US Patent
LigandPNGBDBM173640(US9102591, 2-Methyl-N-(1-methyl-4-phenyl-piperidin...)
Affinity DataIC50:  64nM. Assay description: Fluorescent Imaging Plate Reader (FLIPR) assay: Briefly, 293-human or mouse P2X7 stable cells were incubated in sucrose buffer, pH 7.4 [KCl (5 mM), N...
In DepthDetails US Patent
TargetP2X purinoceptor 7(Homo sapiens (Human))
H. Lundbeck
US Patent
LigandPNGBDBM173640(US9102591, 2-Methyl-N-(1-methyl-4-phenyl-piperidin...)
Affinity DataIC50:  64nMpH: 7.4 T: 2°C. Assay description: Fluorescent Imaging Plate Reader (FLIPR) assay: Briefly, 293-human or mouse P2X7 stable cells were incubated in sucrose buffer, pH 7.4 [KCl (5 mM), N...
In DepthDetails US Patent