BDBM175343 Ethyl4-((1-(4-chlorophenyl)-2-(3,4-dihydroquinolin-1(2H)-yl)ethoxy)carbonylamino) benzoate (6l)
SMILES CCOC(=O)c1ccc(NC(=O)OC(CN2CCCc3ccccc23)c2ccc(Cl)cc2)cc1
InChI Key InChIKey=UCTVYKYYHUALTO-UHFFFAOYSA-N
Data  1 IC50
  Tab Delimited (TSV)   2D SDfile   Computed 3D by Vconf -m prep SDfile
Find this compound or compounds like it in BindingDB:
Activity Spreadsheet -- Enzyme Inhibition Constant Data from BindingDB
Found 1 hit for monomerid = 175343
TargetReverse transcriptase protein(Human immunodeficiency virus type 1 group M subtyp...)
Birla Institute Of Technology
LigandPNGBDBM175343(Ethyl4-((1-(4-chlorophenyl)-2-(3,4-dihydroquinolin...)
Affinity DataIC50:  1.23E+4nM. Assay description: The reaction mixture was set with template primer complex, RT enzyme and dNTPs in a lysis buffer with or without inhibitors. The reaction mixture was...
In DepthDetails ArticlePubMed