BDBM175976 US10047103, 9::US9605024, Example 9::US9688695, 9
SMILES COc1nn2cc(nc2s1)-c1cc2c(OCc3cn(nn3)-c3ccccc3)cc(OC)cc2o1
InChI Key InChIKey=UUGPJSSDEZNVQR-UHFFFAOYSA-N
Data  1 IC50  4 EC50
  Tab Delimited (TSV)   2D SDfile   Computed 3D by Vconf -m prep SDfile
Find this compound or compounds like it in BindingDB:
Activity Spreadsheet -- Enzyme Inhibition Constant Data from BindingDB
Found 5 hits for monomerid = 175976
TargetProteinase-activated receptor 4(Homo sapiens (Human))
Bristol-Myers Squibb
US Patent
LigandPNGBDBM175976(US10047103, 9 | US9605024, Example 9 | US9688695, ...)
Affinity DataEC50:  5.30nMT: 2°C. Assay description: The activity of the PAR4 antagonists of the present invention were tested in PAR4 expressing cells by monitoring H-Ala-Phe(4-F)-Pro-Gly-Trp-Leu-Val-L...
Ligand InfoPC cidPC sid
In DepthDetails US Patent
TargetProteinase-activated receptor 4(Homo sapiens (Human))
Bristol-Myers Squibb
US Patent
LigandPNGBDBM175976(US10047103, 9 | US9605024, Example 9 | US9688695, ...)
Affinity DataEC50:  5.30nMT: 2°C. Assay description: Briefly, HEK293 EBNA PAR4 clone 20664.1J cells were plated 24 hrs. prior to experiment in 384 well, Poly-D-Lysine coated, black, clear bottom plates ...
Ligand InfoPC cidPC sid
In DepthDetails US Patent
TargetProteinase-activated receptor 4(Homo sapiens (Human))
Bristol-Myers Squibb
US Patent
LigandPNGBDBM175976(US10047103, 9 | US9605024, Example 9 | US9688695, ...)
Affinity DataEC50:  5.30nM. Assay description: The activity of the PAR4 antagonists of the present invention were tested in PAR4 expressing cells by monitoring H-Ala-Phe(4-F)-Pro-Gly-Trp-Leu-Val-L...
Ligand InfoPC cidPC sid
In DepthDetails US Patent
TargetProthrombin(Homo sapiens (Human))
Bristol-Myers Squibb
US Patent
LigandPNGBDBM175976(US10047103, 9 | US9605024, Example 9 | US9688695, ...)
Affinity DataIC50: >3.00E+3nMT: 2°C. Assay description: The ability of the compounds of the current invention to inhibit platelet aggregation induced by gamma-thrombin was tested in a 96-well microplate ag...
Ligand InfoPC cidPC sid
In DepthDetails US Patent
TargetProteinase-activated receptor 4(Homo sapiens (Human))
Bristol-Myers Squibb
US Patent
LigandPNGBDBM175976(US10047103, 9 | US9605024, Example 9 | US9688695, ...)
Affinity DataEC50: >3.00E+3nMT: 2°C. Assay description: Briefly, PRP or washed platelet suspension (100 μl) was pre-incubated for 5 minutes at room temperature with varying concentrations of compounds...
Ligand InfoPC cidPC sid
In DepthDetails US Patent