BDBM176510 US9120752, 49
SMILES NC(=O)[C@H](Cc1c[nH]cn1)NC(=O)c1cccc(n1)-c1ccc(Oc2ccc(F)cc2)cc1
InChI Key
Data  1 IC50
  Tab Delimited (TSV)   2D SDfile   Computed 3D by Vconf -m prep SDfile
Find this compound or compounds like it in BindingDB:
Activity Spreadsheet -- Enzyme Inhibition Constant Data from BindingDB
Found 1 hit for monomerid = 176510
TargetSodium channel protein type 9 subunit alpha(Homo sapiens (Human))
Purdue Pharma
US Patent
LigandPNGBDBM176510(US9120752, 49)
Affinity DataIC50:  330nMT: 2°C. Assay description: Cells were prepared by plating the recombinant HEK293 cells or other host cells expressing either recombinant or non-recombinant, native, Nav1.7 alph...
Ligand InfoPC cidPC sid
In DepthDetails US Patent