BDBM17802 benzimidazole-urea, 30::methyl N-{6-[3-({[2-fluoro-5-(trifluoromethyl)phenyl]carbamoyl}amino)phenoxy]-1H-1,3-benzodiazol-2-yl}carbamate
SMILES COC(=O)Nc1nc2ccc(Oc3cccc(NC(=O)Nc4cc(ccc4F)C(F)(F)F)c3)cc2[nH]1
InChI Key InChIKey=LQCMQMYFSPQXKA-UHFFFAOYSA-N
Data  2 IC50
  Tab Delimited (TSV)   2D SDfile   Computed 3D by Vconf -m prep SDfile
Find this compound or compounds like it in BindingDB:
Activity Spreadsheet -- Enzyme Inhibition Constant Data from BindingDB
Found 2 hits for monomerid = 17802
TargetVascular endothelial growth factor receptor 2(Homo sapiens (Human))
Gsk
LigandPNGBDBM17802(benzimidazole-urea, 30 | methyl N-{6-[3-({[2-fluor...)
Affinity DataIC50:  17nM. Assay description: The assay uses purified GST-Tie-2 or GST-VEGFR2 interacting with biotinylated peptide substrates. HTRF is based on the proximity of europium cryptate...
In DepthDetails ArticlePubMed
TargetAngiopoietin-1 receptor(Homo sapiens (Human))
Gsk
LigandPNGBDBM17802(benzimidazole-urea, 30 | methyl N-{6-[3-({[2-fluor...)
Affinity DataIC50:  28nMpH: 7.4 T: 2°C. Assay description: The assay uses purified GST-Tie-2 or GST-VEGFR2 interacting with biotinylated peptide substrates. HTRF is based on the proximity of europium cryptate...
In DepthDetails ArticlePubMed