BDBM178118 (2'R*,7S*)-3-(4-methoxybenzyl)-3,5,6,7-tetrahydrospiro[benzo[d][1,2,3]triazole-4,2'-oxiran]-7-yl benzoate (17b)
SMILES COc1ccc(Cn2nnc3[C@H](CC[C@]4(CO4)c23)OC(=O)c2ccccc2)cc1
InChI Key InChIKey=MASFDQMFAOXMMU-AVRDEDQJSA-N
Data  1 IC50
  Tab Delimited (TSV)   2D SDfile   Computed 3D by Vconf -m prep SDfile
Find this compound or compounds like it in BindingDB:
Activity Spreadsheet -- Enzyme Inhibition Constant Data from BindingDB
Found 1 hit for monomerid = 178118
TargetMethionine aminopeptidase 2(Homo sapiens (Human))
German Cancer Research Center (Dkfz)
LigandPNGBDBM178118((2'R*,7S*)-3-(4-methoxybenzyl)-3,5,6,7-tetrahy...)
Affinity DataIC50:  3.50E+4nMpH: 7.5Assay Description:Stock solutions for all assays were prepared in DMSO (10 mM) and stored at −20 °C. Assays were performed in 96 well plates (Greiner) at a total...
In DepthDetails ArticlePubMed