BDBM178224 US9120812, 9
SMILES CCNC(=O)Nc1ccc(cc1)-c1nc(nc2OC(C)(C)CN(CCCO)C(=O)c12)N1CC2CCC(C1)O2
InChI Key InChIKey=IJVWFAFGTUMQEJ-UHFFFAOYSA-N
Data  2 IC50
  Tab Delimited (TSV)   2D SDfile   Computed 3D by Vconf -m prep SDfile
Find this compound or compounds like it in BindingDB:
Activity Spreadsheet -- Enzyme Inhibition Constant Data from BindingDB
Found 2 hits for monomerid = 178224
TargetPhosphatidylinositol 3-kinase regulatory subunit alpha(Homo sapiens (Human))
Sanofi
US Patent
LigandPNGBDBM178224(US9120812, 9)
Affinity DataIC50: >1.00E+4nMpH: 7.5Assay Description:The test uses a lucifeurerin/luciferase system to measure the concentration of ATP and its consumption during the enzymatic reaction. The test is per...
In DepthDetails US Patent
TargetSerine/threonine-protein kinase mTOR(Homo sapiens (Human))
Sanofi
US Patent
LigandPNGBDBM178224(US9120812, 9)
Affinity DataIC50:  65nMpH: 7.5 T: 2°C. Assay description: The test detects the phosphorylation of the substrate GFP-4EBP1 using a terbium-labelled antibody that is specific for the phospho-Thr46 epitope. Bin...
In DepthDetails US Patent