BDBM179896 US10287250, Compound C.14::US10752592, Compound TABLE C.0::US9133125, Table C, Compound 14::US9656961, Example 00164
SMILES CC1C2Cc3ccc(cc3[C@]1(C)CCN2CC1(C)CC1)C(N)=O
InChI Key InChIKey=JSRNTMOLJYTAIF-RJGDCVCESA-N
Data  6 KI  6 IC50
  Tab Delimited (TSV)   2D SDfile   Computed 3D by Vconf -m prep SDfile
Find this compound or compounds like it in BindingDB:
Activity Spreadsheet -- Enzyme Inhibition Constant Data from BindingDB
Found 11 hits for monomerid = 179896
TargetMu-type opioid receptor(Homo sapiens (Human))
Alkermes Pharma Ireland
US Patent
LigandPNGBDBM179896(US10287250, Compound C.14 | US10752592, Compound T...)
Affinity DataKi:  1.20nM ΔG°:  -12.2kcal/mole IC50:  44nMpH: 7.5 T: 2°C. Assay description: The Ki (binding affinity) for u opioid receptors was determined using a competitive displacement assay as previously described in Neumeyer (Journal o...
In DepthDetails US Patent
TargetMu-type opioid receptor(Homo sapiens (Human))
Alkermes Pharma Ireland
US Patent
LigandPNGBDBM179896(US10287250, Compound C.14 | US10752592, Compound T...)
Affinity DataKi:  1.20nM. Assay description: The Ki (binding affinity) for opioid receptors was determined using a competitive displacement assay as previously described in Neumeyer (Journal of ...
In DepthDetails US Patent
TargetMu-type opioid receptor(Homo sapiens (Human))
Alkermes Pharma Ireland
US Patent
LigandPNGBDBM179896(US10287250, Compound C.14 | US10752592, Compound T...)
Affinity DataKi:  1.20nM. Assay description: The Ki (binding affinity) for μ opioid receptors was determined using a competitive displacement assay as previously described in Neumeyer (Jour...
In DepthDetails US Patent
TargetMu-type opioid receptor(Homo sapiens (Human))
Alkermes Pharma Ireland
US Patent
LigandPNGBDBM179896(US10287250, Compound C.14 | US10752592, Compound T...)
Affinity DataKi:  1.20nM. Assay description: The Ki (binding affinity) for μ opioid receptors was determined using a competitive displacement assay as previously described in Neumeyer (Jour...
In DepthDetails US Patent
TargetMu-type opioid receptor(Homo sapiens (Human))
Alkermes Pharma Ireland
US Patent
LigandPNGBDBM179896(US10287250, Compound C.14 | US10752592, Compound T...)
Affinity DataKi:  1.20nM. Assay description: The Ki (binding affinity) for μ opioid receptors was determined using a competitive displacement assay as previously described in Neumeyer (Jour...
In DepthDetails US Patent
TargetMu-type opioid receptor(Homo sapiens (Human))
Alkermes Pharma Ireland
US Patent
LigandPNGBDBM179896(US10287250, Compound C.14 | US10752592, Compound T...)
Affinity DataKi:  1.20nM. Assay description: The Ki (binding affinity) for μ opioid receptors was determined using a competitive displacement assay as previously described in Neumeyer (Jour...
In DepthDetails US Patent
TargetMu-type opioid receptor(Homo sapiens (Human))
Alkermes Pharma Ireland
US Patent
LigandPNGBDBM179896(US10287250, Compound C.14 | US10752592, Compound T...)
Affinity DataIC50:  44nM. Assay description: The Ki (binding affinity) for μ opioid receptors was determined using a competitive displacement assay as previously described in Neumeyer (Jour...
In DepthDetails US Patent
TargetMu-type opioid receptor(Homo sapiens (Human))
Alkermes Pharma Ireland
US Patent
LigandPNGBDBM179896(US10287250, Compound C.14 | US10752592, Compound T...)
Affinity DataIC50:  44nM. Assay description: The Ki (binding affinity) for μ opioid receptors was determined using a competitive displacement assay as previously described in Neumeyer (Jour...
In DepthDetails US Patent
TargetMu-type opioid receptor(Homo sapiens (Human))
Alkermes Pharma Ireland
US Patent
LigandPNGBDBM179896(US10287250, Compound C.14 | US10752592, Compound T...)
Affinity DataIC50:  44nM. Assay description: The Ki (binding affinity) for μ opioid receptors was determined using a competitive displacement assay as previously described in Neumeyer (Jour...
In DepthDetails US Patent
TargetMu-type opioid receptor(Homo sapiens (Human))
Alkermes Pharma Ireland
US Patent
LigandPNGBDBM179896(US10287250, Compound C.14 | US10752592, Compound T...)
Affinity DataIC50:  44nM. Assay description: The Ki (binding affinity) for μ opioid receptors was determined using a competitive displacement assay as previously described in Neumeyer (Jour...
In DepthDetails US Patent
TargetMu-type opioid receptor(Homo sapiens (Human))
Alkermes Pharma Ireland
US Patent
LigandPNGBDBM179896(US10287250, Compound C.14 | US10752592, Compound T...)
Affinity DataIC50:  44nM. Assay description: The Ki (binding affinity) for opioid receptors was determined using a competitive displacement assay as previously described in Neumeyer (Journal of ...
In DepthDetails US Patent