BDBM186335 US9163017, 9
SMILES CC(C)c1ccc2c(Nc3cc(ccc3Sc3ccc(N)cc3)C#Cc3ccc(cc3)-c3c[nH]c(n3)[C@@H]3CCCN3C(=O)[C@H](N(C)C)c3ccccc3)ncnc2n1
InChI Key
Data  1 IC50
  Tab Delimited (TSV)   2D SDfile   Computed 3D by Vconf -m prep SDfile
Find this compound or compounds like it in BindingDB:
Activity Spreadsheet -- Enzyme Inhibition Constant Data from BindingDB
Found 1 hit for monomerid = 186335
TargetGenome polyprotein(Hepatitis C virus (HCV genotype 1a, isolate H))
Abbvie
US Patent
LigandPNGBDBM186335(US9163017, 9)
Affinity DataIC50:  5.05nM. Assay description: The inhibitory effects of the compounds of the invention on HCV replication can be determined by measuring activity of the luciferase reporter gene. ...
In DepthDetails US Patent