BDBM1879 3-(5-chloro-1,3-thiazol-2-yl)-1-(2-phenylethyl)thiourea::N-(2-Phenethyl)-N -(2-(5-chlorothiazolyl))thiourea::PETT Analog 46
SMILES Clc1cnc(NC(=S)NCCc2ccccc2)s1
InChI Key InChIKey=FRTOQBKWAXWZAM-UHFFFAOYSA-N
Data  1 IC50
  Tab Delimited (TSV)   2D SDfile   Computed 3D by Vconf -m prep SDfile
Find this compound or compounds like it in BindingDB:
Activity Spreadsheet -- Enzyme Inhibition Constant Data from BindingDB
Found 1 hit for monomerid = 1879
TargetGag-Pol polyprotein [588-1027]/[588-1147](Human immunodeficiency virus type 1)
Eli Lilly
LigandPNGBDBM1879(3-(5-chloro-1,3-thiazol-2-yl)-1-(2-phenylethyl)thi...)
Affinity DataIC50:  2.40E+3nMpH: 7.8 T: 2°C. Assay description: The IC50 of reverse transcriptase is the concentration that inhibits 50% of recombinant HIV-1 RT RNA-directed DNA polymerase activity in vitro.
In DepthDetails ArticlePubMed