BDBM188388 US9169224, 77
SMILES O=C(Nc1ccccc1)N1CCN(Cc2ccc(OCc3ccccc3)cc2)CC1
InChI Key InChIKey=PIUOBBHKDQPBNO-UHFFFAOYSA-N
Data  1 IC50
  Tab Delimited (TSV)   2D SDfile   Computed 3D by Vconf -m prep SDfile
Find this compound or compounds like it in BindingDB:
Activity Spreadsheet -- Enzyme Inhibition Constant Data from BindingDB
Found 1 hit for monomerid = 188388
TargetFatty-acid amide hydrolase 1(Homo sapiens (Human))
Janssen Pharmaceutica
US Patent
LigandPNGBDBM188388(US9169224, 77)
Affinity DataIC50:  32nMpH: 9.0Assay Description:Assay Method 1: T84 frozen pellets (contents of 1-4x15 cm culture dishes) were homogenized in 300 mL of FAAH assay buffer (125 mM Tris, 1 mM EDTA, 0....
In DepthDetails US Patent