BDBM18842 Substituted Acrylate, 6j::pentyl 4-(prop-2-enoyloxy)benzoate
SMILES CCCCCOC(=O)c1ccc(OC(=O)C=C)cc1
InChI Key InChIKey=FVRSIGNIIGMHKW-UHFFFAOYSA-N
Data  2 IC50
  Tab Delimited (TSV)   2D SDfile   Computed 3D by Vconf -m prep SDfile
Find this compound or compounds like it in BindingDB:
Activity Spreadsheet -- Enzyme Inhibition Constant Data from BindingDB
Found 2 hits for monomerid = 18842
TargetThyroid hormone receptor beta [209-461](Homo sapiens (Human))
St. Jude Research Hospital
LigandPNGBDBM18842(Substituted Acrylate, 6j | pentyl 4-(prop-2-enoylo...)
Affinity DataIC50:  5.58E+4nM. Assay description: IC50 is the concentration of each compound required to inhibit 50% of the binding between the TR LBD and the SRC2-2 peptide using fluorescence polari...
In DepthDetails ArticlePubMed
TargetThyroid hormone receptor alpha [148-410](Homo sapiens (Human))
St. Jude Research Hospital
LigandPNGBDBM18842(Substituted Acrylate, 6j | pentyl 4-(prop-2-enoylo...)
Affinity DataIC50: >1.00E+5nM. Assay description: IC50 is the concentration of each compound required to inhibit 50% of the binding between the TR LBD and the SRC2-2 peptide using fluorescence polari...
In DepthDetails ArticlePubMed