BDBM189358 Asta Z 4942::Ifosfamide::Iphosphamide::N,3-bis(2-chloroethyl)-2-oxo-1,3,2-oxazaphosphinan-2-amine
SMILES ClCCNP1(=O)OCCCN1CCCl
InChI Key InChIKey=HOMGKSMUEGBAAB-UHFFFAOYSA-N
Data  1 KI  5 IC50
  Tab Delimited (TSV)   2D SDfile   Computed 3D by Vconf -m prep SDfile
Find this compound or compounds like it in BindingDB:
Activity Spreadsheet -- Enzyme Inhibition Constant Data from BindingDB
Found 5 hits for monomerid = 189358
TargetSerum paraoxonase/arylesterase 1(Homo sapiens (Human))
Ahi Evran University
LigandPNGBDBM189358(Asta Z 4942 | Ifosfamide | Iphosphamide | N,3-bis(...)
Affinity DataKi:  8.97E+6nM IC50:  2.33E+7nMpH: 10.5Assay Description:Paraoxonase enzyme activity was determined at 25 °C with paraoxon (1 mM) in 50 mM glycine-NaOH (pH 10.5) containing 1 mM CaCl2. The enzyme assay was ...
In DepthDetails ArticlePubMed
TargetATP-binding cassette sub-family C member 3(Homo sapiens (Human))
Amgen
Curated by ChEMBL
LigandPNGBDBM189358(Asta Z 4942 | Ifosfamide | Iphosphamide | N,3-bis(...)
Affinity DataIC50: >1.33E+5nM. Assay description: Inhibition of human MRP3 overexpressed in Sf9 insect cell membrane vesicles assessed as uptake of [3H]-estradiol-17beta-D-glucuronide in presence of ...
In DepthDetails ArticlePubMed
TargetBile salt export pump(Homo sapiens (Human))
Amgen
Curated by ChEMBL
LigandPNGBDBM189358(Asta Z 4942 | Ifosfamide | Iphosphamide | N,3-bis(...)
Affinity DataIC50: >1.33E+5nM. Assay description: Inhibition of human BSEP overexpressed in Sf9 cell membrane vesicles assessed as uptake of [3H]-taurocholate in presence of ATP measured after 15 to ...
In DepthDetails ArticlePubMed
TargetATP-binding cassette sub-family C member 2(Homo sapiens (Human))
Amgen
Curated by ChEMBL
LigandPNGBDBM189358(Asta Z 4942 | Ifosfamide | Iphosphamide | N,3-bis(...)
Affinity DataIC50: >1.33E+5nM. Assay description: Inhibition of human MRP2 overexpressed in Sf9 cell membrane vesicles assessed as uptake of [3H]-estradiol-17beta-D-glucuronide in presence of ATP and...
In DepthDetails ArticlePubMed
TargetATP-binding cassette sub-family C member 4(Homo sapiens (Human))
Amgen
Curated by ChEMBL
LigandPNGBDBM189358(Asta Z 4942 | Ifosfamide | Iphosphamide | N,3-bis(...)
Affinity DataIC50: >1.33E+5nM. Assay description: Inhibition of human MRP4 overexpressed in Sf9 cell membrane vesicles assessed as uptake of [3H]-estradiol-17beta-D-glucuronide in presence of ATP and...
In DepthDetails ArticlePubMed