BDBM192445 US9187466, 9::US9687476, 9
SMILES O[C@@H](Cn1c(nn(Cc2nc(no2)-c2ccccc2C(F)(F)F)c1=O)-c1ccc(Cl)cc1)C(F)(F)F
InChI Key InChIKey=LZLAQEJNKBBBQN-HNNXBMFYSA-N
Data  4 IC50
  Tab Delimited (TSV)   2D SDfile   Computed 3D by Vconf -m prep SDfile
Find this compound or compounds like it in BindingDB:
Activity Spreadsheet -- Enzyme Inhibition Constant Data from BindingDB
Found 4 hits for monomerid = 192445
TargetVasopressin V1a receptor(Homo sapiens (Human))
Bayer Intellectual Property
US Patent
LigandPNGBDBM192445(US9187466, 9 | US9687476, 9)
Affinity DataIC50:  60nM. Assay description: On the day before the assay, the cells are plated out in culture medium (DMEM, 10% FCS, 2 mM glutamine, 10 mM HEPES) in 384-well microtiter plates an...
Ligand InfoPC cidPC sid
In DepthDetails US Patent
TargetVasopressin V2 receptor(Homo sapiens (Human))
Bayer Intellectual Property
US Patent
LigandPNGBDBM192445(US9187466, 9 | US9687476, 9)
Affinity DataIC50:  23nMT: 2°C. Assay description: On the day before the assay, the cells are plated out in culture medium (DMEM, 10% FCS, 2 mM glutamine, 10 mM HEPES) in 384-well microtiter plates an...
Ligand InfoPC cidPC sid
In DepthDetails US Patent
TargetVasopressin V1a receptor(Homo sapiens (Human))
Bayer Intellectual Property
US Patent
LigandPNGBDBM192445(US9187466, 9 | US9687476, 9)
Affinity DataIC50:  60nMT: 2°C. Assay description: On the day before the assay, the cells are plated out in culture medium (DMEM, 10% FCS, 2 mM glutamine, 10 mM HEPES) in 384-well microtiter plates an...
Ligand InfoPC cidPC sid
In DepthDetails US Patent
TargetVasopressin V2 receptor(Homo sapiens (Human))
Bayer Intellectual Property
US Patent
LigandPNGBDBM192445(US9187466, 9 | US9687476, 9)
Affinity DataIC50:  23nM. Assay description: On the day before the assay, the cells are plated out in culture medium (DMEM, 10% FCS, 2 mM glutamine, 10 mM HEPES) in 384-well microtiter plates an...
Ligand InfoPC cidPC sid
In DepthDetails US Patent