BDBM19345 N-[(1R)-2-(1H-indol-3-yl)-1-{4-[(4-methoxyphenyl)methyl]-5-(2-phenylethyl)-4H-1,2,4-triazol-3-yl}ethyl]piperazine-2-carboxamide::Trisubstituted 1,2,4-Triazole, 53
SMILES COc1ccc(Cn2c(CCc3ccccc3)nnc2[C@@H](Cc2c[nH]c3ccccc23)NC(=O)C2CNCCN2)cc1
InChI Key InChIKey=AVTOEUFCBKGYLY-IDCGIGBZSA-N
Data  1 IC50  1 EC50
  Tab Delimited (TSV)   2D SDfile   Computed 3D by Vconf -m prep SDfile
Find this compound or compounds like it in BindingDB:
Activity Spreadsheet -- Enzyme Inhibition Constant Data from BindingDB
Found 1 hit for monomerid = 19345
TargetGrowth hormone secretagogue receptor type 1(Homo sapiens (Human))
Cnrs
LigandPNGBDBM19345(N-[(1R)-2-(1H-indol-3-yl)-1-{4-[(4-methoxyphenyl)m...)
Affinity DataIC50:  54nM EC50:  12nM. Assay description: Specific binding was determined by incubation of membranes from GHS-R1a transfected LLC cells with 125I-His9-ghrelin in the presence of increasing co...
In DepthDetails ArticlePubMed