BDBM194788 US9206167, 9::USRE48059, Compound of Example 9
SMILES O=c1ccc2ccccc2n1CCCCCN1CCN(CC1)c1cccc2sccc12
InChI Key InChIKey=QRSVODFJOPEHOT-UHFFFAOYSA-N
Data  2 KI
  Tab Delimited (TSV)   2D SDfile   Computed 3D by Vconf -m prep SDfile
Find this compound or compounds like it in BindingDB:
Activity Spreadsheet -- Enzyme Inhibition Constant Data from BindingDB
Found 2 hits for monomerid = 194788
Target5-hydroxytryptamine receptor 2A(Rattus norvegicus (rat))
Otsuka Pharmaceutical
US Patent
LigandPNGBDBM194788(US9206167, 9 | USRE48059, Compound of Example 9)
Affinity DataKi:  2.60nM. Assay description: 5-HT2A: The binding assay was performed using 40 μl of the membrane specimen, 20 μl of [3H]-Ketanserin (final concentration 1 to 3 nM), 20 ...
Ligand InfoPC cidPC sid
In DepthDetails US Patent
Target5-hydroxytryptamine receptor 2A(Rattus norvegicus (rat))
Otsuka Pharmaceutical
US Patent
LigandPNGBDBM194788(US9206167, 9 | USRE48059, Compound of Example 9)
Affinity DataKi:  2.60nM ΔG°:  -12.2kcal/molepH: 7.4 T: 2°C. Assay description: The assay was performed according to the method by Leysen J E et al. (Leysen J E, Niemegeers C J E, Van Nueten J M and Laduron P M. [3H] Ketanserin (...
Ligand InfoPC cidPC sid
In DepthDetails US Patent