BDBM195324 US9670212, 40 N-methyl-N'-[(8-methyl-2-{methyl[2-(methylamino)ethyl]amino}quinolin-3-yl)methyl]cyclopropane-1,1-dicarboxamide
SMILES CNCCN(C)c1nc2c(C)cccc2cc1CNC(=O)C1(CC1)C(=O)NC
InChI Key InChIKey=NNCUJBCSLGFPNZ-UHFFFAOYSA-N
Data  1 IC50
  Tab Delimited (TSV)   2D SDfile   Computed 3D by Vconf -m prep SDfile
Find this compound or compounds like it in BindingDB:
Activity Spreadsheet -- Enzyme Inhibition Constant Data from BindingDB
Found 1 hit for monomerid = 195324
LigandPNGBDBM195324(US9670212, 40 N-methyl-N'-[(8-methyl-2-{methyl[2-(...)
Affinity DataIC50:  1.00E+3nM. Assay description: Kinase activity is measured as the percent of ATP consumed following the kinase reaction using luciferase-luciferin-coupled chemiluminescence. Reacti...
Ligand InfoPC cidPC sid
In DepthDetails US Patent