BDBM195619 US9670212, 82 3-amino-N-({8-methyl-2-[methyl(2-{methyl[(4-methylphenyl)sulfonyl]amino}ethyl)amino]quinolin-3-yl}methyl)pyrazine-2-carboxamide
SMILES CC(CCN(C)c1nc2c(C)cccc2cc1CNC(=O)c1nccnc1N)S(=O)(=O)c1ccc(C)cc1
InChI Key InChIKey=VHRZGJTUKMWSGW-UHFFFAOYSA-N
Data  1 IC50
  Tab Delimited (TSV)   2D SDfile   Computed 3D by Vconf -m prep SDfile
Find this compound or compounds like it in BindingDB:
Activity Spreadsheet -- Enzyme Inhibition Constant Data from BindingDB
Found 1 hit for monomerid = 195619
LigandPNGBDBM195619(US9670212, 82 3-amino-N-({8-methyl-2-[methyl(2-{me...)
Affinity DataIC50:  1.00E+3nM. Assay description: Kinase activity is measured as the percent of ATP consumed following the kinase reaction using luciferase-luciferin-coupled chemiluminescence. Reacti...
Ligand InfoPC cidPC sid
In DepthDetails US Patent