BDBM196354 US9212130, I-274
SMILES COc1ccc(cn1)C(=O)Nc1cnc(Nc2ccc(OC(C)C)c(F)c2)n(Cc2ccc(Cl)cc2)c1=O
InChI Key InChIKey=XARRKDFAEBEYLC-UHFFFAOYSA-N
Data  1 IC50
  Tab Delimited (TSV)   2D SDfile   Computed 3D by Vconf -m prep SDfile
Find this compound or compounds like it in BindingDB:
Activity Spreadsheet -- Enzyme Inhibition Constant Data from BindingDB
Found 1 hit for monomerid = 196354
TargetP2X purinoceptor 3(Homo sapiens (Human))
Shionogi
US Patent
LigandPNGBDBM196354(US9212130, I-274)
Affinity DataIC50:  66nMpH: 7.5Assay Description:Stably expressing cell line (C6BU-1 cell transfected with human P2X3 receptor gene (GenBank accession number Y07683) was used. The cells were seeded ...
Ligand InfoPC cidPC sid
In DepthDetails US Patent