BDBM198013 US9221795, 9
SMILES C[C@H](Nc1nc(N)nc(N)c1C#N)c1nc2cccc(c2c(=O)n1-c1cccnc1)C(F)(F)F
InChI Key InChIKey=VXTPCJFWYKTESW-JTQLQIEISA-N
Data  1 IC50
  Tab Delimited (TSV)   2D SDfile   Computed 3D by Vconf -m prep SDfile
Find this compound or compounds like it in BindingDB:
Activity Spreadsheet -- Enzyme Inhibition Constant Data from BindingDB
Found 1 hit for monomerid = 198013
TargetPhosphatidylinositol 4,5-bisphosphate 3-kinase catalytic subunit delta isoform(Homo sapiens (Human))
Gilead Sciences
US Patent
LigandPNGBDBM198013(US9221795, 9)
Affinity DataIC50:  2nMpH: 7.4Assay Description:Class I PI3K isoforms were expressed and purified as heterodimeric recombinant proteins. All assay reagents and buffers for the TR-FRET assay were pu...
Ligand InfoPC cidPC sid
In DepthDetails US Patent