BDBM19959 3-arylquinazolinethione, 1bg::5-(acetyloxy)-3-[4-(acetyloxy)phenyl]-4-sulfanylidene-3,4-dihydroquinazolin-7-yl acetate
SMILES CC(=O)Oc1ccc(cc1)-n1cnc2cc(OC(C)=O)cc(OC(C)=O)c2c1=S
InChI Key InChIKey=QEFJVTSRLWANGJ-UHFFFAOYSA-N
Data  1 EC50
  Tab Delimited (TSV)   2D SDfile   Computed 3D by Vconf -m prep SDfile
Find this compound or compounds like it in BindingDB:
Activity Spreadsheet -- Enzyme Inhibition Constant Data from BindingDB
Found 2 hits for monomerid = 19959
TargetEstrogen receptor beta(Homo sapiens (Human))
Bristol-Myers Squibb
LigandPNGBDBM19959(3-arylquinazolinethione, 1bg | 5-(acetyloxy)-3-[4-...)
Affinity DataEC50:  1.13E+4nM. Assay description: Ligand binding was determined using a scintillation proximity assay with streptavidin-coated SPA beads (Amersham) and biotinylated receptor. Receptor...
In DepthDetails ArticlePubMed
TargetEstrogen receptor(Homo sapiens (Human))
Bristol-Myers Squibb
LigandPNGBDBM19959(3-arylquinazolinethione, 1bg | 5-(acetyloxy)-3-[4-...)
Affinity Data. Assay description: Ligand binding was determined using a scintillation proximity assay with streptavidin-coated SPA beads (Amersham) and biotinylated receptor. Receptor...
In DepthDetails ArticlePubMed