BDBM200213 Adenosine receptor agonist, 9
SMILES Nc1nc(=O)[nH]c2n(cnc12)[C@@H]1O[C@H](CO)[C@@H](O)[C@H]1O
InChI Key
Data  3 KI
  Tab Delimited (TSV)   2D SDfile   Computed 3D by Vconf -m prep SDfile
Find this compound or compounds like it in BindingDB:
Activity Spreadsheet -- Enzyme Inhibition Constant Data from BindingDB
Found 3 hits for monomerid = 200213
TargetAdenosine receptor A3(Homo sapiens (Human))
Uppsala University
LigandPNGBDBM200213(Adenosine receptor agonist, 9)
Affinity DataKi:  348nM. Assay description: Radioligand binding assays were performed using membranes prepared from CHO (hA1AR or hA3AR) or HEK293 (hA2AAR) cells stably expressing a single hAR ...
In DepthDetails ArticlePubMed
TargetAdenosine receptor A1(Homo sapiens (Human))
Uppsala University
LigandPNGBDBM200213(Adenosine receptor agonist, 9)
Affinity DataKi:  467nM. Assay description: Radioligand binding assays were performed using membranes prepared from CHO (hA1AR or hA3AR) or HEK293 (hA2AAR) cells stably expressing a single hAR ...
In DepthDetails ArticlePubMed
TargetAdenosine receptor A2a(Homo sapiens (Human))
Uppsala University
LigandPNGBDBM200213(Adenosine receptor agonist, 9)
Affinity DataKi:  495nM. Assay description: Radioligand binding assays were performed using membranes prepared from CHO (hA1AR or hA3AR) or HEK293 (hA2AAR) cells stably expressing a single hAR ...
In DepthDetails ArticlePubMed