BDBM200229 AB00694549-11::Atropine::cid_174174
SMILES [H][C@]12CC[C@]([H])(CC(C1)OC(=O)C(CO)c1ccccc1)N2C
InChI Key InChIKey=RKUNBYITZUJHSG-PJPHBNEVSA-N
Data  2 IC50  1 EC50
  Tab Delimited (TSV)   2D SDfile   Computed 3D by Vconf -m prep SDfile
Find this compound or compounds like it in BindingDB:
Activity Spreadsheet -- Enzyme Inhibition Constant Data from BindingDB
Found 3 hits for monomerid = 200229
TargetCystic fibrosis transmembrane conductance regulator(Homo sapiens (Human))
Southern Research Institute
Curated by PubChem BioAssay
LigandPNGBDBM200229(AB00694549-11 | Atropine | cid_174174)
Affinity DataIC50:  2.14E+4nM
In DepthDetails PCBioAssay
TargetMuscarinic acetylcholine receptor M3(Homo sapiens (Human))
Almirall
US Patent
LigandPNGBDBM200229(AB00694549-11 | Atropine | cid_174174)
Affinity DataIC50:  3.20nMT: 2°C. Assay description: Assays were carried out at 25° C. Membrane preparations from stably transfected chinese hamster ovary-K1 cells (CHO) expressing the genes for the...
In DepthDetails US Patent
TargetCystic fibrosis transmembrane conductance regulator(Homo sapiens (Human))
Southern Research Institute
Curated by PubChem BioAssay
LigandPNGBDBM200229(AB00694549-11 | Atropine | cid_174174)
Affinity DataEC50: >5.00E+4nM
In DepthDetails PCBioAssay