BDBM20110 dipeptide-derived nitrile, 31::tert-butyl N-[(1S)-1-[(cyanomethyl)carbamoyl]-2-(1H-indol-3-yl)ethyl]carbamate
SMILES CC(C)(C)OC(=O)N[C@@H](Cc1c[nH]c2ccccc12)C(=O)NCC#N
InChI Key InChIKey=SDZKELBCDXVVFO-HNNXBMFYSA-N
Data  6 KI
  Tab Delimited (TSV)   2D SDfile   Computed 3D by Vconf -m prep SDfile
Find this compound or compounds like it in BindingDB:
Activity Spreadsheet -- Enzyme Inhibition Constant Data from BindingDB
Found 6 hits for monomerid = 20110
TargetCathepsin S(Homo sapiens (Human))
Rheinische Friedrich-Wilhelms-Universitat Bonn
LigandPNGBDBM20110(dipeptide-derived nitrile, 31 | tert-butyl N-[(1S)...)
Affinity DataKi:  240nM. Assay description: Enzyme activities were calculated from kinetic measurements performed by fluorimetric detection of the product AMC at the wavelengths for excitation ...
In DepthDetails ArticlePubMed
TargetCathepsin B(Homo sapiens (Human))
University Of Bonn
Curated by ChEMBL
LigandPNGBDBM20110(dipeptide-derived nitrile, 31 | tert-butyl N-[(1S)...)
Affinity DataKi: >330nMpH: 6.0Assay Description:Inhibition of human liver cathepsin B using Cbz-Arg-Arg-pNA as substrate at pH 6 incubated for 30 mins measured for 20 mins by photometrical analysis
In DepthDetails ArticlePubMed
TargetProcathepsin L(Bos taurus (bovine))
Rheinische Friedrich-Wilhelms-Universitat Bonn
LigandPNGBDBM20110(dipeptide-derived nitrile, 31 | tert-butyl N-[(1S)...)
Affinity DataKi:  350nM. Assay description: Enzyme activities were calculated from kinetic measurements performed by fluorimetric detection of the product AMC at the wavelengths for excitation ...
In DepthDetails ArticlePubMed
TargetProcathepsin L(Homo sapiens (Human))
Rheinische Friedrich-Wilhelms-Universitat Bonn
LigandPNGBDBM20110(dipeptide-derived nitrile, 31 | tert-butyl N-[(1S)...)
Affinity DataKi:  430nM. Assay description: Enzyme activities were calculated from kinetic measurements performed by fluorimetric detection of the product AMC at the wavelengths for excitation ...
In DepthDetails ArticlePubMed
TargetPapain(Carica papaya)
Rheinische Friedrich-Wilhelms-Universitat Bonn
LigandPNGBDBM20110(dipeptide-derived nitrile, 31 | tert-butyl N-[(1S)...)
Affinity DataKi:  7.60E+3nM. Assay description: Enzyme activities were calculated from kinetic measurements performed by spectrophotometric detection of the product p-nitroaniline (pNA) at waveleng...
In DepthDetails ArticlePubMed
TargetCathepsin K(Homo sapiens (Human))
Rheinische Friedrich-Wilhelms-Universitat Bonn
LigandPNGBDBM20110(dipeptide-derived nitrile, 31 | tert-butyl N-[(1S)...)
Affinity DataKi:  2.90E+4nM. Assay description: Enzyme activities were calculated from kinetic measurements performed by fluorimetric detection of the product AMC at the wavelengths for excitation ...
In DepthDetails ArticlePubMed