BDBM20112 dipeptide-derived nitrile, 33::tert-butyl N-[(1S)-1-[(cyanomethyl)carbamoyl]-2-(naphthalen-1-yl)ethyl]carbamate
SMILES CC(C)(C)OC(=O)N[C@@H](Cc1cccc2ccccc12)C(=O)NCC#N
InChI Key InChIKey=IUQLLQAVULHKJG-KRWDZBQOSA-N
Data  5 KI
  Tab Delimited (TSV)   2D SDfile   Computed 3D by Vconf -m prep SDfile
Find this compound or compounds like it in BindingDB:
Activity Spreadsheet -- Enzyme Inhibition Constant Data from BindingDB
Found 5 hits for monomerid = 20112
TargetCathepsin B(Homo sapiens (Human))
University Of Bonn
Curated by ChEMBL
LigandPNGBDBM20112(dipeptide-derived nitrile, 33 | tert-butyl N-[(1S)...)
Affinity DataKi: >330nMpH: 6.0Assay Description:Inhibition of human liver cathepsin B using Cbz-Arg-Arg-pNA as substrate at pH 6 incubated for 30 mins measured for 20 mins by photometrical analysis
In DepthDetails ArticlePubMed
TargetCathepsin S(Homo sapiens (Human))
Rheinische Friedrich-Wilhelms-Universitat Bonn
LigandPNGBDBM20112(dipeptide-derived nitrile, 33 | tert-butyl N-[(1S)...)
Affinity DataKi:  1.30E+3nM. Assay description: Enzyme activities were calculated from kinetic measurements performed by fluorimetric detection of the product AMC at the wavelengths for excitation ...
In DepthDetails ArticlePubMed
TargetProcathepsin L(Bos taurus (bovine))
Rheinische Friedrich-Wilhelms-Universitat Bonn
LigandPNGBDBM20112(dipeptide-derived nitrile, 33 | tert-butyl N-[(1S)...)
Affinity DataKi:  1.70E+3nM. Assay description: Enzyme activities were calculated from kinetic measurements performed by fluorimetric detection of the product AMC at the wavelengths for excitation ...
In DepthDetails ArticlePubMed
TargetPapain(Carica papaya)
Rheinische Friedrich-Wilhelms-Universitat Bonn
LigandPNGBDBM20112(dipeptide-derived nitrile, 33 | tert-butyl N-[(1S)...)
Affinity DataKi:  2.80E+4nM. Assay description: Enzyme activities were calculated from kinetic measurements performed by spectrophotometric detection of the product p-nitroaniline (pNA) at waveleng...
In DepthDetails ArticlePubMed
TargetCathepsin K(Homo sapiens (Human))
Rheinische Friedrich-Wilhelms-Universitat Bonn
LigandPNGBDBM20112(dipeptide-derived nitrile, 33 | tert-butyl N-[(1S)...)
Affinity DataKi:  6.60E+4nM. Assay description: Enzyme activities were calculated from kinetic measurements performed by fluorimetric detection of the product AMC at the wavelengths for excitation ...
In DepthDetails ArticlePubMed