BDBM201209 US9233968, 9
SMILES Fc1ccc(cc1NC(=O)Nc1ccc(cc1)C#Cc1ccc2nccn2n1)C(F)(F)F
InChI Key InChIKey=GCDJEWLBVJYFEY-UHFFFAOYSA-N
Data  3 IC50
  Tab Delimited (TSV)   2D SDfile   Computed 3D by Vconf -m prep SDfile
Find this compound or compounds like it in BindingDB:
Activity Spreadsheet -- Enzyme Inhibition Constant Data from BindingDB
Found 3 hits for monomerid = 201209
TargetVascular endothelial growth factor receptor 2(Homo sapiens (Human))
Allergan
US Patent
LigandPNGBDBM201209(US9233968, 9)
Affinity DataIC50:  448nMpH: 7.4 T: 2°C. Assay description: Biochemical KDR kinase assays were performed in 96 well microtiter plates that were coated overnight with 75 μg/well of poly-Glu-Tyr (4:1) in 10...
Ligand InfoPC cidPC sid
In DepthDetails US Patent
TargetVascular endothelial growth factor receptor 2(Homo sapiens (Human))
Allergan
US Patent
LigandPNGBDBM201209(US9233968, 9)
Affinity DataIC50:  8.42E+3nMT: 2°C. Assay description: Automated FLIPR (Fluorometric Imaging Plate Reader) technology was used to screen for inhibitors of VEGF induced increases in intracellular calcium l...
Ligand InfoPC cidPC sid
In DepthDetails US Patent
TargetPlatelet-derived growth factor receptor beta(Homo sapiens (Human))
Allergan
US Patent
LigandPNGBDBM201209(US9233968, 9)
Affinity DataIC50:  93nMpH: 7.4 T: 2°C. Assay description: Biochemical KDR kinase assays were performed in 96 well microtiter plates that were coated overnight with 75 μg/well of poly-Glu-Tyr (4:1) in 10...
Ligand InfoPC cidPC sid
In DepthDetails US Patent