BDBM20425 (4-methylphenyl)methyl N-(isoquinolin-5-yl)carbamate::isoquinoline deriv., 31b
SMILES Cc1ccc(COC(=O)Nc2cccc3cnccc23)cc1
InChI Key InChIKey=PWPLRTGRYJNZIU-UHFFFAOYSA-N
Data  1 EC50
  Tab Delimited (TSV)   2D SDfile   Computed 3D by Vconf -m prep SDfile
Find this compound or compounds like it in BindingDB:
Activity Spreadsheet -- Enzyme Inhibition Constant Data from BindingDB
Found 1 hit for monomerid = 20425
TargetTransient receptor potential cation channel subfamily V member 1(Homo sapiens (Human))
Abbott Laboratories
LigandPNGBDBM20425((4-methylphenyl)methyl N-(isoquinolin-5-yl)carbama...)
Affinity DataEC50:  313nMpH: 7.4 T: 2°C. Assay description: The functional antagonist activity of compounds at the TRPV1 receptor was determined with a Ca2+ influx assay by measuring the effect on capsaicin (0...
In DepthDetails ArticlePubMed