BDBM206933 US9233965, 9
SMILES CC(C)CNC(=O)N1CCn2c(C1)c(C(N)=O)c(c2C1CC1)-c1ccccc1
InChI Key InChIKey=GRLJVHQMHDAJGW-UHFFFAOYSA-N
Data  1 IC50
  Tab Delimited (TSV)   2D SDfile   Computed 3D by Vconf -m prep SDfile
Find this compound or compounds like it in BindingDB:
Activity Spreadsheet -- Enzyme Inhibition Constant Data from BindingDB
Found 1 hit for monomerid = 206933
TargetCasein kinase I isoform epsilon(Homo sapiens (Human))
Sanofi
US Patent
LigandPNGBDBM206933(US9233965, 9)
Affinity DataIC50:  49nMpH: 7.5 T: 2°C. Assay description: "U"-bottomed Falcon plates are prepared by placing 5 uL of solutions of the compounds according to the invention at concentrations of 10, 1, 0.1, 0.0...
Ligand InfoPC cidPC sid
In DepthDetails US Patent