BDBM209929 c-Niraparib
SMILES NCCCN1CCC[C@H](C1)c1ccc(cc1)-n1cc2cccc(C(N)=O)c2n1
InChI Key InChIKey=QNMALODLYAPVNV-QGZVFWFLSA-N
Data  1 IC50
  Tab Delimited (TSV)   2D SDfile   Computed 3D by Vconf -m prep SDfile
Find this compound or compounds like it in BindingDB:
Activity Spreadsheet -- Enzyme Inhibition Constant Data from BindingDB
Found 1 hit for monomerid = 209929
TargetPoly [ADP-ribose] polymerase 1(Homo sapiens (Human))
H. Lee Moffitt Cancer Center & Research Institute
LigandPNGBDBM209929(c-Niraparib)
Affinity DataIC50:  48.4nM. Assay description: Inhibition of PARP1 was assessed using the Universal Chemiluminescent PARPKit. Luminescence readings were normalized to controls and fit to a sigmoid...
Ligand InfoPC cidPC sid
In DepthDetails ArticlePubMed