BDBM210871 US9290467, 41
SMILES Clc1cc2C[C@H](NC(=O)c3cc(ccc3OC\C=C\COc1cc2)C1CNC1)C(=O)NC1(CC1)C#N
InChI Key InChIKey=GIZLJBNLBSDHDB-BIWRPXHWSA-N
Data  1 IC50
PDB links: 1 PDB ID matches this monomer.
  Tab Delimited (TSV)   2D SDfile   Computed 3D by Vconf -m prep SDfile
Find this compound or compounds like it in BindingDB:
Activity Spreadsheet -- Enzyme Inhibition Constant Data from BindingDB
Found 1 hit for monomerid = 210871
TargetProcathepsin L(Homo sapiens (Human))
Hoffmann-La Roche
US Patent
LigandPNGBDBM210871(US9290467, 41)
Affinity DataIC50:  5.20nMpH: 6.5Assay Description:Enzyme activity is measured by observing the increase in fluorescence intensity caused by cleavage of a peptide substrate containing a fluorophore wh...
Ligand InfoPC cidPC sidPDB